搜索

420

主题

496

帖子

1836

积分

金牌会员

Rank: 6Rank: 6

积分
1836
发表于 2021-2-5 22:19:27 69 浏览 1 回复

Ubuntu-16.04.7-LTS 报错 libz.so.1

/hd720_fast_charging_ani-06.raw /media/dat1/mtk8788/mt8788_v5.196/out/target/product/tb8788p1_64_bsp/obj/BOOTLOADER_OBJ/build-tb8788p1_64_bsp/dev/logo/hd720/hd720_fast_charging_00.raw /media/dat1/mtk8788/mt8788_v5.196/out/target/product/tb8788p1_64_bsp/obj/BOOTLOADER_OBJ/build-tb8788p1_64_bsp/dev/logo/hd720/hd720_fast_charging_01.raw /media/dat1/mtk8788/mt8788_v5.196/out/target/product/tb8788p1_64_bsp/obj/BOOTLOADER_OBJ/build-tb8788p1_64_bsp/dev/logo/hd720/hd720_fast_charging_02.raw /media/dat1/mtk8788/mt8788_v5.196/out/target/product/tb8788p1_64_bsp/obj/BOOTLOADER_OBJ/build-tb8788p1_64_bsp/dev/logo/hd720/hd720_fast_charging_03.raw /media/dat1/mtk8788/mt8788_v5.196/out/target/product/tb8788p1_64_bsp/obj/BOOTLOADER_OBJ/build-tb8788p1_64_bsp/dev/logo/hd720/hd720_fast_charging_04.raw /media/dat1/mtk8788/mt8788_v5.196/out/target/product/tb8788p1_64_bsp/obj/BOOTLOADER_OBJ/build-tb8788p1_64_bsp/dev/logo/hd720/hd720_fast_charging_05.raw /media/dat1/mtk8788/mt8788_v5.196/out/target/product/tb8788p1_64_bsp/obj/BOOTLOADER_OBJ/build-tb8788p1_64_bsp/dev/logo/hd720/hd720_fast_charging_06.raw /media/dat1/mtk8788/mt8788_v5.196/out/target/product/tb8788p1_64_bsp/obj/BOOTLOADER_OBJ/build-tb8788p1_64_bsp/dev/logo/hd720/hd720_fast_charging_07.raw /media/dat1/mtk8788/mt8788_v5.196/out/target/product/tb8788p1_64_bsp/obj/BOOTLOADER_OBJ/build-tb8788p1_64_bsp/dev/logo/hd720/hd720_fast_charging_08.raw /media/dat1/mtk8788/mt8788_v5.196/out/target/product/tb8788p1_64_bsp/obj/BOOTLOADER_OBJ/build-tb8788p1_64_bsp/dev/logo/hd720/hd720_fast_charging_09.raw /media/dat1/mtk8788/mt8788_v5.196/out/target/product/tb8788p1_64_bsp/obj/BOOTLOADER_OBJ/build-tb8788p1_64_bsp/dev/logo/hd720/hd720_fast_charging_percent.raw
dev/logo/tool/zpipe: error while loading shared libraries: libz.so.1: cannot open shared object file: No such file or directory
/media/dat1/mtk8788/mt8788_v5.196/out/target/product/tb8788p1_64_bsp/obj/BOOTLOADER_OBJ/build-tb8788p1_64_bsp/version.h.tmp /media/dat1/mtk8788/mt8788_v5.196/out/target/product/tb8788p1_64_bsp/obj/BOOTLOADER_OBJ/build-tb8788p1_64_bsp/version.h differ: byte 190, line 4
dev/logo/rules.mk:240: recipe for target '/media/dat1/mtk8788/mt8788_v5.196/out/target/product/tb8788p1_64_bsp/obj/BOOTLOADER_OBJ/build-tb8788p1_64_bsp/dev/logo/hd720.raw' failed
make[1]: *** [/media/dat1/mtk8788/mt8788_v5.196/out/target/product/tb8788p1_64_bsp/obj/BOOTLOADER_OBJ/build-tb8788p1_64_bsp/dev/logo/hd720.raw] Error 127
make[1]: *** Waiting for unfinished jobs....
make[1]: Leaving directory '/media/dat1/mtk8788/mt8788_v5.196/vendor/mediatek/proprietary/bootable/bootloader/lk'
makefile:20: recipe for target 'make-make' failed
make: *** [make-make] Error 2
回复

使用道具 举报

420

主题

496

帖子

1836

积分

金牌会员

Rank: 6Rank: 6

积分
1836
 楼主| 发表于 2021-2-5 22:20:02
安装依赖:
sudo apt-get install lib32z1
回复

使用道具 举报

返回列表
您需要登录后才可以回帖 登录 | 立即注册

本版积分规则


登录或注册
快速回复 返回顶部 返回列表